Target
S-adenosylmethionine synthase isoform type-2
Ligand
BDBM50576017
Substrate
Meas. Tech.
ChEMBL_2126195 (CHEMBL4835540)
IC50
4.0±n/a nM
Citation
 Konteatis, ZTravins, JGross, SMarjon, KBarnett, AMandley, ENicolay, BNagaraja, RChen, YSun, YLiu, ZYu, JYe, ZJiang, FWei, WFang, CGao, YKalev, PHyer, MLDeLaBarre, BJin, LPadyana, AKDang, LMurtie, JBiller, SASui, ZMarks, KM Discovery of AG-270, a First-in-Class Oral MAT2A Inhibitor for the Treatment of Tumors with Homozygous  J Med Chem 64:4430-4449 (2021)  
Target
Name:
S-adenosylmethionine synthase isoform type-2
Synonyms:
AMS2 MAT 2 MAT2A METK2_HUMAN Methionine adenosyltransferase II
Type:
Protein
Mol. Mass.:
43659.65
Organism:
Human
Description:
P31153
Residue:
395
  
Inhibitor
Name:
BDBM50576017
Synonyms:
CHEMBL4552959
Type:
Small organic molecule
Emp. Form.:
C32H23N7O4
Mol. Mass.:
569.5695
SMILES:
CCOC(=O)c1nnc(Nc2[nH]c3c(c(nn3c(=O)c2-c2ccc3ncccc3c2)-c2ccccc2)-c2ccccc2)o1
: