Target
Hormone-sensitive lipase
Ligand
BDBM50142731
Substrate
Meas. Tech.
ChEBML_88047
IC50
5±n/a nM
Citation
 de Jong, JCSørensen, LGTornqvist, HJacobsen, P Carbazates as potent inhibitors of hormone-sensitive lipase. Bioorg Med Chem Lett 14:1741-4 (2004)  
Target
Name:
Hormone-sensitive lipase
Synonyms:
HSL Hormone-sensitive lipase (HSL) LIPS_HUMAN
Type:
Protein
Mol. Mass.:
116599.07
Organism:
Homo sapiens (Human)
Description:
Q05469
Residue:
1076
  
Inhibitor
Name:
BDBM50142731
Synonyms:
CHEMBL49417 | [4-(Morpholin-4-ylcarbamoyloxy)-phenyl]-acetic acid benzyl ester
Type:
Small organic molecule
Emp. Form.:
C20H22N2O5
Mol. Mass.:
370.3991
SMILES:
O=C(Cc1ccc(OC(=O)NN2CCOCC2)cc1)OCc1ccccc1
: