Target
Muscarinic acetylcholine receptor M2
Ligand
BDBM50142803
Substrate
Meas. Tech.
ChEBML_139762
Ki
7±n/a nM
Citation
 Palani, ADugar, SClader, JWGreenlee, WJRuperto, VDuffy, RALachowicz, JE Isopropyl amide derivatives of potent and selective muscarinic M2 receptor antagonists. Bioorg Med Chem Lett 14:1791-4 (2004)  
Target
Name:
Muscarinic acetylcholine receptor M2
Synonyms:
ACM2_HUMAN Cholinergic, muscarinic M2 Muscarinic acetylcholine receptor M2 and M5 | RecName: Full=Muscarinic acetylcholine receptor M2
Type:
GPCR
Mol. Mass.:
51730.61
Organism:
Homo sapiens (Human)
Description:
P08172
Residue:
466
  
Inhibitor
Name:
BDBM50142803
Synonyms:
CHEMBL49975 | N-Isopropyl-4-[1'-(2-methyl-benzoyl)-[1,4']bipiperidinyl-4-ylmethyl]-benzamide
Type:
Small organic molecule
Emp. Form.:
C29H39N3O2
Mol. Mass.:
461.6389
SMILES:
CC(C)NC(=O)c1ccc(CC2CCN(CC2)C2CCN(CC2)C(=O)c2ccccc2C)cc1
: