Target
Muscarinic acetylcholine receptor M2
Ligand
BDBM50142804
Substrate
Meas. Tech.
ChEBML_139762
Ki
2.4±n/a nM
Citation
 Palani, ADugar, SClader, JWGreenlee, WJRuperto, VDuffy, RALachowicz, JE Isopropyl amide derivatives of potent and selective muscarinic M2 receptor antagonists. Bioorg Med Chem Lett 14:1791-4 (2004)  
Target
Name:
Muscarinic acetylcholine receptor M2
Synonyms:
ACM2_HUMAN Cholinergic, muscarinic M2 Muscarinic acetylcholine receptor M2 and M5 | RecName: Full=Muscarinic acetylcholine receptor M2
Type:
GPCR
Mol. Mass.:
51730.61
Organism:
Homo sapiens (Human)
Description:
P08172
Residue:
466
  
Inhibitor
Name:
BDBM50142804
Synonyms:
4-{2-[1'-(4-Fluoro-naphthalene-1-carbonyl)-[1,4']bipiperidinyl-4-yl]-[1,3]dioxolan-2-yl}-N-isopropyl-benzamide | CHEMBL51096
Type:
Small organic molecule
Emp. Form.:
C34H40FN3O4
Mol. Mass.:
573.6975
SMILES:
CC(C)NC(=O)c1ccc(cc1)C1(OCCO1)C1CCN(CC1)C1CCN(CC1)C(=O)c1ccc(F)c2ccccc12
: