Target
Muscarinic acetylcholine receptor M2
Ligand
BDBM50121490
Substrate
Meas. Tech.
ChEBML_139762
Ki
17±n/a nM
Citation
 Palani, ADugar, SClader, JWGreenlee, WJRuperto, VDuffy, RALachowicz, JE Isopropyl amide derivatives of potent and selective muscarinic M2 receptor antagonists. Bioorg Med Chem Lett 14:1791-4 (2004)  
Target
Name:
Muscarinic acetylcholine receptor M2
Synonyms:
ACM2_HUMAN Cholinergic, muscarinic M2 Muscarinic acetylcholine receptor M2 and M5 | RecName: Full=Muscarinic acetylcholine receptor M2
Type:
GPCR
Mol. Mass.:
51730.61
Organism:
Homo sapiens (Human)
Description:
P08172
Residue:
466
  
Inhibitor
Name:
BDBM50121490
Synonyms:
(4-Fluoro-naphthalen-1-yl)-{4-[4-(propane-2-sulfonyl)-benzyl]-[1,4']bipiperidinyl-1'-yl}-methanone | CHEMBL52203
Type:
Small organic molecule
Emp. Form.:
C31H37FN2O3S
Mol. Mass.:
536.7
SMILES:
CC(C)S(=O)(=O)c1ccc(CC2CCN(CC2)C2CCN(CC2)C(=O)c2ccc(F)c3ccccc23)cc1
: