Target
Muscarinic acetylcholine receptor M2
Ligand
BDBM50142809
Substrate
Meas. Tech.
ChEBML_139762
Ki
2.1±n/a nM
Citation
 Palani, ADugar, SClader, JWGreenlee, WJRuperto, VDuffy, RALachowicz, JE Isopropyl amide derivatives of potent and selective muscarinic M2 receptor antagonists. Bioorg Med Chem Lett 14:1791-4 (2004)  
Target
Name:
Muscarinic acetylcholine receptor M2
Synonyms:
ACM2_HUMAN Cholinergic, muscarinic M2 Muscarinic acetylcholine receptor M2 and M5 | RecName: Full=Muscarinic acetylcholine receptor M2
Type:
GPCR
Mol. Mass.:
51730.61
Organism:
Homo sapiens (Human)
Description:
P08172
Residue:
466
  
Inhibitor
Name:
BDBM50142809
Synonyms:
4-[1'-(4-Fluoro-naphthalene-1-carbonyl)-[1,4']bipiperidinyl-4-ylmethyl]-N-isopropyl-benzamide | CHEMBL51459
Type:
Small organic molecule
Emp. Form.:
C32H38FN3O2
Mol. Mass.:
515.6614
SMILES:
CC(C)NC(=O)c1ccc(CC2CCN(CC2)C2CCN(CC2)C(=O)c2ccc(F)c3ccccc23)cc1
: