Target
Muscarinic acetylcholine receptor M2
Ligand
BDBM50121489
Substrate
Meas. Tech.
ChEBML_139762
Ki
0.890000±n/a nM
Citation
 Palani, ADugar, SClader, JWGreenlee, WJRuperto, VDuffy, RALachowicz, JE Isopropyl amide derivatives of potent and selective muscarinic M2 receptor antagonists. Bioorg Med Chem Lett 14:1791-4 (2004)  
Target
Name:
Muscarinic acetylcholine receptor M2
Synonyms:
ACM2_HUMAN Cholinergic, muscarinic M2 Muscarinic acetylcholine receptor M2 and M5 | RecName: Full=Muscarinic acetylcholine receptor M2
Type:
GPCR
Mol. Mass.:
51730.61
Organism:
Homo sapiens (Human)
Description:
P08172
Residue:
466
  
Inhibitor
Name:
BDBM50121489
Synonyms:
(2-Amino-3-methyl-phenyl)-(4-{1-[4-(propane-2-sulfinyl)-phenyl]-ethylidene}-[1,4']bipiperidinyl-1'-yl)-methanone | CHEMBL418446
Type:
Small organic molecule
Emp. Form.:
C29H39N3O2S
Mol. Mass.:
493.704
SMILES:
[#6]-[#6](-[#6])S(=O)c1ccc(cc1)-[#6](\[#6])=[#6]-1/[#6]-[#6]-[#7](-[#6]-[#6]-1)-[#6]-1-[#6]-[#6]-[#7](-[#6]-[#6]-1)-[#6](=O)-c1cccc(-[#6])c1-[#7]
: