Target
Muscarinic acetylcholine receptor M2
Ligand
BDBM50142812
Substrate
Meas. Tech.
ChEBML_139762
Ki
9±n/a nM
Citation
 Palani, ADugar, SClader, JWGreenlee, WJRuperto, VDuffy, RALachowicz, JE Isopropyl amide derivatives of potent and selective muscarinic M2 receptor antagonists. Bioorg Med Chem Lett 14:1791-4 (2004)  
Target
Name:
Muscarinic acetylcholine receptor M2
Synonyms:
ACM2_HUMAN Cholinergic, muscarinic M2 Muscarinic acetylcholine receptor M2 and M5 | RecName: Full=Muscarinic acetylcholine receptor M2
Type:
GPCR
Mol. Mass.:
51730.61
Organism:
Homo sapiens (Human)
Description:
P08172
Residue:
466
  
Inhibitor
Name:
BDBM50142812
Synonyms:
4-[1'-(2-Amino-3-methyl-benzoyl)-[1,4']bipiperidinyl-4-ylmethyl]-N-isopropyl-benzamide | CHEMBL50618
Type:
Small organic molecule
Emp. Form.:
C29H40N4O2
Mol. Mass.:
476.6535
SMILES:
CC(C)NC(=O)c1ccc(CC2CCN(CC2)C2CCN(CC2)C(=O)c2cccc(C)c2N)cc1
: