Target
Muscarinic acetylcholine receptor M2
Ligand
BDBM50142821
Substrate
Meas. Tech.
ChEBML_139762
Ki
122±n/a nM
Citation
 Palani, ADugar, SClader, JWGreenlee, WJRuperto, VDuffy, RALachowicz, JE Isopropyl amide derivatives of potent and selective muscarinic M2 receptor antagonists. Bioorg Med Chem Lett 14:1791-4 (2004)  
Target
Name:
Muscarinic acetylcholine receptor M2
Synonyms:
ACM2_HUMAN Cholinergic, muscarinic M2 Muscarinic acetylcholine receptor M2 and M5 | RecName: Full=Muscarinic acetylcholine receptor M2
Type:
GPCR
Mol. Mass.:
51730.61
Organism:
Homo sapiens (Human)
Description:
P08172
Residue:
466
  
Inhibitor
Name:
BDBM50142821
Synonyms:
4-[1'-(2-Methyl-benzoyl)-[1,4']bipiperidinyl-4-ylmethyl]-N-phenyl-benzamide | CHEMBL51588
Type:
Small organic molecule
Emp. Form.:
C32H37N3O2
Mol. Mass.:
495.6551
SMILES:
Cc1ccccc1C(=O)N1CCC(CC1)N1CCC(Cc2ccc(cc2)C(=O)Nc2ccccc2)CC1
: