Target
Muscarinic acetylcholine receptor M2
Ligand
BDBM50142825
Substrate
Meas. Tech.
ChEBML_139762
Ki
104±n/a nM
Citation
 Palani, ADugar, SClader, JWGreenlee, WJRuperto, VDuffy, RALachowicz, JE Isopropyl amide derivatives of potent and selective muscarinic M2 receptor antagonists. Bioorg Med Chem Lett 14:1791-4 (2004)  
Target
Name:
Muscarinic acetylcholine receptor M2
Synonyms:
ACM2_HUMAN Cholinergic, muscarinic M2 Muscarinic acetylcholine receptor M2 and M5 | RecName: Full=Muscarinic acetylcholine receptor M2
Type:
GPCR
Mol. Mass.:
51730.61
Organism:
Homo sapiens (Human)
Description:
P08172
Residue:
466
  
Inhibitor
Name:
BDBM50142825
Synonyms:
4-[1'-(4-Fluoro-naphthalene-1-carbonyl)-[1,4']bipiperidinyl-4-ylmethyl]-N-phenyl-benzamide | CHEMBL50584
Type:
Small organic molecule
Emp. Form.:
C35H36FN3O2
Mol. Mass.:
549.6776
SMILES:
Fc1ccc(C(=O)N2CCC(CC2)N2CCC(Cc3ccc(cc3)C(=O)Nc3ccccc3)CC2)c2ccccc12
: