Target
Sodium-dependent serotonin transporter
Ligand
BDBM50142842
Substrate
Meas. Tech.
ChEMBL_201798 (CHEMBL806133)
Ki
2.3±n/a nM
Citation
 Davies, HMHopper, DWHansen, TLiu, QChilders, SR Synthesis of methylphenidate analogues and their binding affinities at dopamine and serotonin transport sites. Bioorg Med Chem Lett 14:1799-802 (2004)  
Target
Name:
Sodium-dependent serotonin transporter
Synonyms:
5-HT Transporter 5HT transporter Anandamid membrane transporter, AMT Monoamine transporters; Norepinephrine & serotonin Slc6a4 Sodium-dependent serotonin transporter (SERT) | imipramine receptor
Type:
Multi-pass membrane protein
Mol. Mass.:
70168.43
Organism:
Rattus norvegicus (rat)
Description:
P31652
Residue:
630
  
Inhibitor
Name:
BDBM50142842
Synonyms:
(S)-2-[(R)-Methoxycarbonyl-(6-methyl-naphthalen-2-yl)-methyl]-pyrrolidinium; chloride | CHEMBL50990
Type:
Small organic molecule
Emp. Form.:
C18H22NO2
Mol. Mass.:
284.3722
SMILES:
COC(=O)[C@@H]([C@@H]1CCC[NH2+]1)c1ccc2cc(C)ccc2c1
: