Target
Sodium-dependent serotonin transporter
Ligand
BDBM50142860
Substrate
Meas. Tech.
ChEBML_201798
Ki
>10000±n/a nM
Citation
 Davies, HMHopper, DWHansen, TLiu, QChilders, SR Synthesis of methylphenidate analogues and their binding affinities at dopamine and serotonin transport sites. Bioorg Med Chem Lett 14:1799-802 (2004)  
Target
Name:
Sodium-dependent serotonin transporter
Synonyms:
5-HT Transporter 5HT transporter Anandamid membrane transporter, AMT Monoamine transporters; Norepinephrine & serotonin Slc6a4 Sodium-dependent serotonin transporter (SERT) | imipramine receptor
Type:
Multi-pass membrane protein
Mol. Mass.:
70168.43
Organism:
Rattus norvegicus (rat)
Description:
P31652
Residue:
630
  
Inhibitor
Name:
BDBM50142860
Synonyms:
(S)-2-((R)-Methoxycarbonyl-p-tolyl-methyl)-pyrrolidinium; chloride | CHEMBL50628
Type:
Small organic molecule
Emp. Form.:
C14H20NO2
Mol. Mass.:
234.3136
SMILES:
COC(=O)[C@@H]([C@@H]1CCC[NH2+]1)c1ccc(C)cc1
: