Target
Sodium-dependent dopamine transporter
Ligand
BDBM50142841
Substrate
Meas. Tech.
ChEMBL_62161 (CHEMBL675004)
IC50
2050±n/a nM
Citation
 Davies, HMHopper, DWHansen, TLiu, QChilders, SR Synthesis of methylphenidate analogues and their binding affinities at dopamine and serotonin transport sites. Bioorg Med Chem Lett 14:1799-802 (2004)  
Target
Name:
Sodium-dependent dopamine transporter
Synonyms:
DA transporter SC6A3_RAT Sodium-dependent dopamine transporter | Sodium-dependent dopamine transporter (DAT)
Type:
Multi-pass membrane protein
Mol. Mass.:
68749.45
Organism:
Rattus norvegicus (rat)
Description:
P23977
Residue:
619
  
Inhibitor
Name:
BDBM50142841
Synonyms:
(S)-2-[(R)-Methoxycarbonyl-(6-methoxy-naphthalen-2-yl)-methyl]-pyrrolidinium; chloride | CHEMBL51503
Type:
Small organic molecule
Emp. Form.:
C18H22NO3
Mol. Mass.:
300.3716
SMILES:
COC(=O)[C@@H]([C@@H]1CCC[NH2+]1)c1ccc2cc(OC)ccc2c1
: