Target
Bromodomain testis-specific protein
Ligand
BDBM50576427
Substrate
Meas. Tech.
ChEMBL_2127220 (CHEMBL4836565)
IC50
25±n/a nM
Citation
 Seal, JTAtkinson, SJBamborough, PBassil, AChung, CWFoley, JGordon, LGrandi, PGray, JRJHarrison, LAKruger, RGMatteo, JJMcCabe, MTMessenger, CMitchell, DPhillipou, APreston, APrinjha, RKRianjongdee, FRioja, ITaylor, SWall, IDWatson, RJWoolven, JMWyce, AZhang, XPDemont, EH Fragment-based Scaffold Hopping: Identification of Potent, Selective, and Highly Soluble Bromo and Extra Terminal Domain (BET) Second Bromodomain (BD2) Inhibitors. J Med Chem 64:10772-10805 (2021)  
Target
Name:
Bromodomain testis-specific protein
Synonyms:
BRDT Bromodomain and extra-terminal motif (BET) Cancer/testis antigen 9 | RING3-like protein
Type:
PROTEIN
Mol. Mass.:
107982.01
Organism:
Homo sapiens (Human)
Description:
ChEMBL_1502985
Residue:
947
  
Inhibitor
Name:
BDBM50576427
Synonyms:
CHEMBL4865767
Type:
Small organic molecule
Emp. Form.:
C21H26N2O4
Mol. Mass.:
370.4421
SMILES:
CNC(=O)c1cc(C(=O)N[C@H]2CC[C@H](O)CC2)c(o1)[C@@H](C)c1ccccc1
: