Target
N-acetylated-alpha-linked acidic dipeptidase 2
Ligand
BDBM50143064
Substrate
Meas. Tech.
ChEMBL_71707 (CHEMBL680921)
Ki
95.3±n/a nM
Citation
 Kozikowski, APZhang, JNan, FPetukhov, PAGrajkowska, EWroblewski, JTYamamoto, TBzdega, TWroblewska, BNeale, JH Synthesis of urea-based inhibitors as active site probes of glutamate carboxypeptidase II: efficacy as analgesic agents. J Med Chem 47:1729-38 (2004)  
Target
Name:
N-acetylated-alpha-linked acidic dipeptidase 2
Synonyms:
N-acetylated-alpha-linked acidic dipeptidase 2 NAALAD2 NALD2_HUMAN
Type:
PROTEIN
Mol. Mass.:
83602.57
Organism:
Homo sapiens (Human)
Description:
ChEMBL_71707
Residue:
740
  
Inhibitor
Name:
BDBM50143064
Synonyms:
(2S,5R)-2-Benzyl-4-[3-((S)-3-carboxy-1-carboxy-propyl)-ureido]-pentanedioic acid | CHEMBL47416
Type:
Small organic molecule
Emp. Form.:
C18H22N2O9
Mol. Mass.:
410.3753
SMILES:
OC(=O)CC[C@H](NC(=O)N[C@@H](C[C@@H](Cc1ccccc1)C(O)=O)C(O)=O)C(O)=O
: