Target
N-acetylated-alpha-linked acidic dipeptidase 2
Ligand
BDBM50143065
Substrate
Meas. Tech.
ChEMBL_71707 (CHEMBL680921)
Ki
4388±n/a nM
Citation
 Kozikowski, APZhang, JNan, FPetukhov, PAGrajkowska, EWroblewski, JTYamamoto, TBzdega, TWroblewska, BNeale, JH Synthesis of urea-based inhibitors as active site probes of glutamate carboxypeptidase II: efficacy as analgesic agents. J Med Chem 47:1729-38 (2004)  
Target
Name:
N-acetylated-alpha-linked acidic dipeptidase 2
Synonyms:
N-acetylated-alpha-linked acidic dipeptidase 2 NAALAD2 NALD2_HUMAN
Type:
PROTEIN
Mol. Mass.:
83602.57
Organism:
Homo sapiens (Human)
Description:
ChEMBL_71707
Residue:
740
  
Inhibitor
Name:
BDBM50143065
Synonyms:
(S)-4-{3-[(S)-3-Carboxy-1-(1H-tetrazol-5-yl)-propyl]-ureido}-4-(1H-tetrazol-5-yl)-butyric acid | CHEMBL47477
Type:
Small organic molecule
Emp. Form.:
C11H16N10O5
Mol. Mass.:
368.3087
SMILES:
OC(=O)CC[C@H](NC(=O)N[C@@H](CCC(O)=O)c1nnn[nH]1)c1nnn[nH]1
: