Target
N-acetylated-alpha-linked acidic dipeptidase 2
Ligand
BDBM50143068
Substrate
Meas. Tech.
ChEMBL_71707 (CHEMBL680921)
Ki
14.9±n/a nM
Citation
 Kozikowski, APZhang, JNan, FPetukhov, PAGrajkowska, EWroblewski, JTYamamoto, TBzdega, TWroblewska, BNeale, JH Synthesis of urea-based inhibitors as active site probes of glutamate carboxypeptidase II: efficacy as analgesic agents. J Med Chem 47:1729-38 (2004)  
Target
Name:
N-acetylated-alpha-linked acidic dipeptidase 2
Synonyms:
N-acetylated-alpha-linked acidic dipeptidase 2 NAALAD2 NALD2_HUMAN
Type:
PROTEIN
Mol. Mass.:
83602.57
Organism:
Homo sapiens (Human)
Description:
ChEMBL_71707
Residue:
740
  
Inhibitor
Name:
BDBM50143068
Synonyms:
(S)-2-{3-[(S)-1-Carboxy-3-(1H-tetrazol-5-yl)-propyl]-ureido}-4-(1H-tetrazol-5-yl)-butyric acid | CHEMBL49271
Type:
Small organic molecule
Emp. Form.:
C11H16N10O5
Mol. Mass.:
368.3087
SMILES:
OC(=O)[C@H](CCc1nnn[nH]1)NC(=O)N[C@@H](CCc1nnn[nH]1)C(O)=O
: