Target
N-acetylated-alpha-linked acidic dipeptidase 2
Ligand
BDBM50143069
Substrate
Meas. Tech.
ChEMBL_71707 (CHEMBL680921)
Ki
12±n/a nM
Citation
 Kozikowski, APZhang, JNan, FPetukhov, PAGrajkowska, EWroblewski, JTYamamoto, TBzdega, TWroblewska, BNeale, JH Synthesis of urea-based inhibitors as active site probes of glutamate carboxypeptidase II: efficacy as analgesic agents. J Med Chem 47:1729-38 (2004)  
Target
Name:
N-acetylated-alpha-linked acidic dipeptidase 2
Synonyms:
N-acetylated-alpha-linked acidic dipeptidase 2 NAALAD2 NALD2_HUMAN
Type:
PROTEIN
Mol. Mass.:
83602.57
Organism:
Homo sapiens (Human)
Description:
ChEMBL_71707
Residue:
740
  
Inhibitor
Name:
BDBM50143069
Synonyms:
(S)-2-[3-((S)-1-Carboxy-2-phenyl-ethyl)-ureido]-pentanedioic acid | CHEMBL415916
Type:
Small organic molecule
Emp. Form.:
C15H18N2O7
Mol. Mass.:
338.3126
SMILES:
OC(=O)CC[C@H](NC(=O)N[C@@H](Cc1ccccc1)C(O)=O)C(O)=O
: