Target
N-acetylated-alpha-linked acidic dipeptidase 2
Ligand
BDBM17659
Substrate
Meas. Tech.
ChEMBL_71707 (CHEMBL680921)
Ki
1.4±n/a nM
Citation
 Kozikowski, APZhang, JNan, FPetukhov, PAGrajkowska, EWroblewski, JTYamamoto, TBzdega, TWroblewska, BNeale, JH Synthesis of urea-based inhibitors as active site probes of glutamate carboxypeptidase II: efficacy as analgesic agents. J Med Chem 47:1729-38 (2004)  
Target
Name:
N-acetylated-alpha-linked acidic dipeptidase 2
Synonyms:
N-acetylated-alpha-linked acidic dipeptidase 2 NAALAD2 NALD2_HUMAN
Type:
PROTEIN
Mol. Mass.:
83602.57
Organism:
Homo sapiens (Human)
Description:
ChEMBL_71707
Residue:
740
  
Inhibitor
Name:
BDBM17659
Synonyms:
(R,S)-2-phosphonomethylpentanedioic acid 2-PMPA US10894807, ID P009 | pentanedioic acid analogue, (RS)-1
Type:
Small organic molecule
Emp. Form.:
C6H11O7P
Mol. Mass.:
226.1211
SMILES:
OC(=O)CCC(CP(O)(O)=O)C(O)=O
: