Target
N-acetylated-alpha-linked acidic dipeptidase 2
Ligand
BDBM50143080
Substrate
Meas. Tech.
ChEMBL_71707 (CHEMBL680921)
Ki
5.9±n/a nM
Citation
 Kozikowski, APZhang, JNan, FPetukhov, PAGrajkowska, EWroblewski, JTYamamoto, TBzdega, TWroblewska, BNeale, JH Synthesis of urea-based inhibitors as active site probes of glutamate carboxypeptidase II: efficacy as analgesic agents. J Med Chem 47:1729-38 (2004)  
Target
Name:
N-acetylated-alpha-linked acidic dipeptidase 2
Synonyms:
N-acetylated-alpha-linked acidic dipeptidase 2 NAALAD2 NALD2_HUMAN
Type:
PROTEIN
Mol. Mass.:
83602.57
Organism:
Homo sapiens (Human)
Description:
ChEMBL_71707
Residue:
740
  
Inhibitor
Name:
BDBM50143080
Synonyms:
(S)-2-{3-[(S)-Carboxy-(4-hydroxy-phenyl)-methyl]-ureido}-pentanedioic acid | CHEMBL50489
Type:
Small organic molecule
Emp. Form.:
C14H16N2O8
Mol. Mass.:
340.2854
SMILES:
OC(=O)CC[C@H](NC(=O)N[C@H](C(O)=O)c1ccc(O)cc1)C(O)=O
: