Target
Neuronal acetylcholine receptor subunit alpha-3/beta-4
Ligand
BDBM50100715
Substrate
Meas. Tech.
ChEMBL_143402 (CHEMBL752657)
EC50
189±n/a nM
Citation
 Carroll, FI Epibatidine structure-activity relationships. Bioorg Med Chem Lett 14:1889-96 (2004)  
Target
Name:
Neuronal acetylcholine receptor subunit alpha-3/beta-4
Synonyms:
Neuronal acetylcholine receptor Alpha-3/Beta-4 Neuronal acetylcholine receptor; alpha3/beta4 | nAChR subtypes alpha3 beta4
Type:
Protein
Mol. Mass.:
Description:
Components:
This complex has 2 components.
Component 1
Name:
Neuronal acetylcholine receptor subunit alpha-3
Synonyms:
ACHA3_RAT Chrna3
Type:
Enzyme
Mol. Mass.:
56995.52
Organism:
Rattus norvegicus (Rat)
Description:
P04757
Residue:
499
  
Component 2
Name:
Neuronal acetylcholine receptor subunit beta-4
Synonyms:
ACHB4_RAT Chrnb4 Neuronal acetylcholine receptor non-alpha-2 chain | Neuronal acetylcholine receptor protein beta-4 subunit
Type:
Enzyme
Mol. Mass.:
55863.89
Organism:
Rattus norvegicus (Rat)
Description:
P12392
Residue:
495
  
Inhibitor
Name:
BDBM50100715
Synonyms:
2-(6-Bromo-pyridin-3-yl)-7-aza-bicyclo[2.2.1]heptane | CHEMBL301901
Type:
Small organic molecule
Emp. Form.:
C11H13BrN2
Mol. Mass.:
253.138
SMILES:
Brc1ccc(cn1)C1CC2CCC1N2
: