Target
Thioredoxin reductase 1, cytoplasmic
Ligand
BDBM50576852
Substrate
Meas. Tech.
ChEMBL_2128404 (CHEMBL4837833)
IC50
18±n/a nM
Citation
 Ayoup, MSAbu-Serie, MMAbdel-Hamid, HTeleb, M Beyond direct Nrf2 activation; reinvestigating 1,2,4-oxadiazole scaffold as a master key unlocking the antioxidant cellular machinery for cancer therapy. Eur J Med Chem 220:0 (2021)  
Target
Name:
Thioredoxin reductase 1, cytoplasmic
Synonyms:
GRIM-12 Gene associated with retinoid-IFN-induced mortality 12 protein KM-102-derived reductase-like factor TRXR1_HUMAN Thioredoxin reductase 1 Thioredoxin reductase TR1
Type:
Protein
Mol. Mass.:
70761.78
Organism:
Homo sapiens (Human)
Description:
Q16881
Residue:
648
  
Inhibitor
Name:
BDBM50576852
Synonyms:
CHEMBL4849098
Type:
Small organic molecule
Emp. Form.:
C15H12N2O2
Mol. Mass.:
252.268
SMILES:
Oc1ccccc1-c1nc(Cc2ccccc2)no1
: