Target
Alpha-1D adrenergic receptor
Ligand
BDBM50026941
Substrate
Meas. Tech.
ChEMBL_32721 (CHEMBL645993)
Ki
2.02±n/a nM
Citation
 Leonardi, ABarlocco, DMontesano, FCignarella, GMotta, GTesta, RPoggesi, ESeeber, MDe Benedetti, PGFanelli, F Synthesis, screening, and molecular modeling of new potent and selective antagonists at the alpha 1d adrenergic receptor. J Med Chem 47:1900-18 (2004)  
Target
Name:
Alpha-1D adrenergic receptor
Synonyms:
ADA1D_RAT Adra1d Alpha-1D adrenergic receptor | Serotonin 1a (5-HT1a) receptor/Adrenergic receptor alpha-1
Type:
Protein
Mol. Mass.:
59375.97
Organism:
Rattus norvegicus (Rat)
Description:
P23944
Residue:
561
  
Inhibitor
Name:
BDBM50026941
Synonyms:
8-{2-[4-(3-Chloro-phenyl)-piperazin-1-yl]-ethyl}-8-aza-spiro[4.5]decane-7,9-dione | CHEMBL57364
Type:
Small organic molecule
Emp. Form.:
C21H28ClN3O2
Mol. Mass.:
389.919
SMILES:
Clc1cccc(c1)N1CCN(CCN2C(=O)CC3(CCCC3)CC2=O)CC1
: