Target
5-hydroxytryptamine receptor 1A
Ligand
BDBM50143704
Substrate
Meas. Tech.
ChEMBL_924 (CHEMBL615772)
Ki
432.7±n/a nM
Citation
 Leonardi, ABarlocco, DMontesano, FCignarella, GMotta, GTesta, RPoggesi, ESeeber, MDe Benedetti, PGFanelli, F Synthesis, screening, and molecular modeling of new potent and selective antagonists at the alpha 1d adrenergic receptor. J Med Chem 47:1900-18 (2004)  
Target
Name:
5-hydroxytryptamine receptor 1A
Synonyms:
5-HT-1A 5-hydroxytryptamine receptor 1A (5-HT-1A) ADRB2RL1 Dopamine D2 receptor and serotonin 1a receptor HTR1A | Serotonin receptor 1A
Type:
Mol. Mass.:
46122.49
Organism:
Homo sapiens (Human)
Description:
Residue:
422
  
Inhibitor
Name:
BDBM50143704
Synonyms:
8-[2-({2-[(2,5-Dichloro-phenyl)-methyl-amino]-ethyl}-methyl-amino)-ethyl]-8-aza-spiro[4.5]decane-7,9-dione | CHEMBL55790
Type:
Small organic molecule
Emp. Form.:
C21H29Cl2N3O2
Mol. Mass.:
426.38
SMILES:
CN(CCN(C)c1cc(Cl)ccc1Cl)CCN1C(=O)CC2(CCCC2)CC1=O
: