Target
Adenylate cyclase type 10
Ligand
BDBM50577239
Substrate
Meas. Tech.
ChEMBL_2129834 (CHEMBL4839263)
IC50
>1000±n/a nM
Citation
 Fushimi, MBuck, HBalbach, MGorovyy, AFerreira, JRossetti, TKaur, NLevin, LRBuck, JQuast, Jvan den Heuvel, JSteegborn, CFinkin-Groner, EKargman, SMichino, MFoley, MAMiller, MLiverton, NJHuggins, DJMeinke, PT Discovery of TDI-10229: A Potent and Orally Bioavailable Inhibitor of Soluble Adenylyl Cyclase (sAC, ADCY10). ACS Med Chem Lett 12:1283-1287 (2021)  
Target
Name:
Adenylate cyclase type 10
Synonyms:
ADCY10 AH-related protein Germ cell soluble adenylyl cyclase Testicular soluble adenylyl cyclase | hsAC
Type:
PROTEIN
Mol. Mass.:
187169.28
Organism:
Homo sapiens (Human)
Description:
ChEMBL_514281
Residue:
1610
  
Inhibitor
Name:
BDBM50577239
Synonyms:
CHEMBL4862670
Type:
Small organic molecule
Emp. Form.:
C14H14ClN5S
Mol. Mass.:
319.812
SMILES:
Cc1ccc(Cc2cn(C)nc2-c2cc(Cl)nc(N)n2)s1
: