Target
Adenylate cyclase type 10
Ligand
BDBM50577232
Substrate
Meas. Tech.
ChEMBL_2129836 (CHEMBL4839265)
IC50
196±n/a nM
Citation
 Fushimi, MBuck, HBalbach, MGorovyy, AFerreira, JRossetti, TKaur, NLevin, LRBuck, JQuast, Jvan den Heuvel, JSteegborn, CFinkin-Groner, EKargman, SMichino, MFoley, MAMiller, MLiverton, NJHuggins, DJMeinke, PT Discovery of TDI-10229: A Potent and Orally Bioavailable Inhibitor of Soluble Adenylyl Cyclase (sAC, ADCY10). ACS Med Chem Lett 12:1283-1287 (2021)  
Target
Name:
Adenylate cyclase type 10
Synonyms:
ADCY10 AH-related protein Germ cell soluble adenylyl cyclase Testicular soluble adenylyl cyclase | hsAC
Type:
PROTEIN
Mol. Mass.:
187169.28
Organism:
Homo sapiens (Human)
Description:
ChEMBL_514281
Residue:
1610
  
Inhibitor
Name:
BDBM50577232
Synonyms:
CHEMBL4849033
Type:
Small organic molecule
Emp. Form.:
C13H12ClN5S
Mol. Mass.:
305.786
SMILES:
Cn1cc(Cc2cccs2)c(n1)-c1cc(Cl)nc(N)n1
: