Target
C-C chemokine receptor type 1
Ligand
BDBM50144393
Substrate
Meas. Tech.
ChEBML_41887
IC50
26±n/a nM
Citation
 Kath, JCBrissette, WHBrown, MFConklyn, MDiRico, APDorff, PGladue, RPLillie, BMLira, PDMairs, ENMartin, WHMcElroy, EBMcGlynn, MAParadis, TJPoss, CSStock, IATylaska, LAZheng, D Potent small molecule CCR1 antagonists. Bioorg Med Chem Lett 14:2169-73 (2004)  
Target
Name:
C-C chemokine receptor type 1
Synonyms:
C-C CKR-1 CC-CKR-1 CCR1 CD_antigen=CD191 CMKR1 LD78 receptor Macrophage inflammatory protein 1-alpha receptor SCYAR1
Type:
Enzyme
Mol. Mass.:
41180.69
Organism:
Homo sapiens (Human)
Description:
P32246
Residue:
355
  
Inhibitor
Name:
BDBM50144393
Synonyms:
CHEMBL69274 | Quinoxaline-2-carboxylic acid ((1S,2S,4S)-1-benzyl-4-carbamoyl-4-cyclopentyl-2-hydroxy-butyl)-amide
Type:
Small organic molecule
Emp. Form.:
C26H30N4O3
Mol. Mass.:
446.5414
SMILES:
NC(=O)[C@@H](C[C@H](O)[C@H](Cc1ccccc1)NC(=O)c1cnc2ccccc2n1)C1CCCC1
: