Target
C-C chemokine receptor type 1
Ligand
BDBM50144400
Substrate
Meas. Tech.
ChEBML_41887
IC50
28±n/a nM
Citation
 Kath, JCBrissette, WHBrown, MFConklyn, MDiRico, APDorff, PGladue, RPLillie, BMLira, PDMairs, ENMartin, WHMcElroy, EBMcGlynn, MAParadis, TJPoss, CSStock, IATylaska, LAZheng, D Potent small molecule CCR1 antagonists. Bioorg Med Chem Lett 14:2169-73 (2004)  
Target
Name:
C-C chemokine receptor type 1
Synonyms:
C-C CKR-1 CC-CKR-1 CCR1 CD_antigen=CD191 CMKR1 LD78 receptor Macrophage inflammatory protein 1-alpha receptor SCYAR1
Type:
Enzyme
Mol. Mass.:
41180.69
Organism:
Homo sapiens (Human)
Description:
P32246
Residue:
355
  
Inhibitor
Name:
BDBM50144400
Synonyms:
CHEMBL304358 | Quinoxaline-2-carboxylic acid ((1S,2S,4R)-1-benzyl-4-carbamoyl-2-hydroxy-7-methyl-octyl)-amide
Type:
Small organic molecule
Emp. Form.:
C26H32N4O3
Mol. Mass.:
448.5573
SMILES:
CC(C)CC[C@H](C[C@H](O)[C@H](Cc1ccccc1)NC(=O)c1cnc2ccccc2n1)C(N)=O
: