Target
C-C chemokine receptor type 1
Ligand
BDBM50144417
Substrate
Meas. Tech.
ChEMBL_41888 (CHEMBL655681)
IC50
9±n/a nM
Citation
 Brown, MFAvery, MBrissette, WHChang, JHColizza, KConklyn, MDiRico, APGladue, RPKath, JCKrueger, SSLira, PDLillie, BMLundquist, GDMairs, ENMcElroy, EBMcGlynn, MAParadis, TJPoss, CSRossulek, MIShepard, RMSims, JStrelevitz, TJTruesdell, STylaska, LAYoon, KZheng, D Novel CCR1 antagonists with improved metabolic stability. Bioorg Med Chem Lett 14:2175-9 (2004)  
Target
Name:
C-C chemokine receptor type 1
Synonyms:
C-C CKR-1 CC-CKR-1 CCR1 CD_antigen=CD191 CMKR1 LD78 receptor Macrophage inflammatory protein 1-alpha receptor SCYAR1
Type:
Enzyme
Mol. Mass.:
41180.69
Organism:
Homo sapiens (Human)
Description:
P32246
Residue:
355
  
Inhibitor
Name:
BDBM50144417
Synonyms:
CHEMBL68366 | Quinoxaline-2-carboxylic acid ((1S,2S,4R)-1-benzyl-4-carbamoyl-7-fluoro-2-hydroxy-7-methyl-octyl)-amide
Type:
Small organic molecule
Emp. Form.:
C26H31FN4O3
Mol. Mass.:
466.5477
SMILES:
CC(C)(F)CC[C@H](C[C@H](O)[C@H](Cc1ccccc1)NC(=O)c1cnc2ccccc2n1)C(N)=O
: