Target
C-C chemokine receptor type 1
Ligand
BDBM50144420
Substrate
Meas. Tech.
ChEMBL_86826 (CHEMBL694697)
IC50
5±n/a nM
Citation
 Brown, MFAvery, MBrissette, WHChang, JHColizza, KConklyn, MDiRico, APGladue, RPKath, JCKrueger, SSLira, PDLillie, BMLundquist, GDMairs, ENMcElroy, EBMcGlynn, MAParadis, TJPoss, CSRossulek, MIShepard, RMSims, JStrelevitz, TJTruesdell, STylaska, LAYoon, KZheng, D Novel CCR1 antagonists with improved metabolic stability. Bioorg Med Chem Lett 14:2175-9 (2004)  
Target
Name:
C-C chemokine receptor type 1
Synonyms:
C-C CKR-1 CC-CKR-1 CCR1 CD_antigen=CD191 CMKR1 LD78 receptor Macrophage inflammatory protein 1-alpha receptor SCYAR1
Type:
Enzyme
Mol. Mass.:
41180.69
Organism:
Homo sapiens (Human)
Description:
P32246
Residue:
355
  
Inhibitor
Name:
BDBM50144420
Synonyms:
CHEMBL68145 | Quinoxaline-2-carboxylic acid ((1S,2S)-1-benzyl-4-carbamoyl-4-cyclohexyl-2-hydroxy-butyl)-amide
Type:
Small organic molecule
Emp. Form.:
C27H32N4O3
Mol. Mass.:
460.568
SMILES:
NC(=O)C(C[C@H](O)[C@H](Cc1ccccc1)NC(=O)c1cnc2ccccc2n1)C1CCCCC1
: