Target
Serine/threonine-protein kinase 25
Ligand
BDBM50577328
Substrate
Meas. Tech.
ChEMBL_2130022 (CHEMBL4839451)
IC50
>50000±n/a nM
Citation
 Serafim, RAMSorrell, FJBerger, BTCollins, RJVasconcelos, SNSMassirer, KBKnapp, SBennett, JFedorov, OPatel, HZuercher, WJElkins, JM Discovery of a Potent Dual SLK/STK10 Inhibitor Based on a Maleimide Scaffold. J Med Chem 64:13259-13278 (2021)  
Target
Name:
Serine/threonine-protein kinase 25
Synonyms:
SOK1 STK25_HUMAN | YSK1
Type:
PROTEIN
Mol. Mass.:
48113.10
Organism:
Homo sapiens (Human)
Description:
ChEMBL_586495
Residue:
426
  
Inhibitor
Name:
BDBM50577328
Synonyms:
CHEMBL4875188
Type:
Small organic molecule
Emp. Form.:
C18H13N3O3
Mol. Mass.:
319.3141
SMILES:
COc1ccccc1C1=C(Nc2cccc(c2)C#N)C(=O)NC1=O
: