Target
Tyrosine-protein kinase Fgr
Ligand
BDBM50577406
Substrate
Meas. Tech.
ChEMBL_2130169 (CHEMBL4839598)
IC50
41±n/a nM
Citation
 Xie, ZXiang, CLi, XFan, CChen, TLiu, MMa, YBai, FTang, WHu, Y Discovery of Potent Antiallergic Agents Based on an  J Med Chem 64:13588-13603 (2021)  
Target
Name:
Tyrosine-protein kinase Fgr
Synonyms:
FGR Gardner-Rasheed feline sarcoma viral (v-fgr) oncogene homolog SRC p55-Fgr p58c-Fgr
Type:
protein
Mol. Mass.:
59469.88
Organism:
Homo sapiens (Human)
Description:
P09769
Residue:
529
  
Inhibitor
Name:
BDBM50577406
Synonyms:
CHEMBL4862806
Type:
Small organic molecule
Emp. Form.:
C27H19F6N5O
Mol. Mass.:
543.4631
SMILES:
Cc1ccc(cc1C#Cc1cc(cnc1N)-c1cnn(C)c1)C(=O)Nc1cc(cc(c1)C(F)(F)F)C(F)(F)F
: