Target
Fibroblast growth factor 2
Ligand
BDBM50144524
Substrate
Meas. Tech.
ChEBML_70634
Kd
34000±n/a nM
Citation
 Liu, LPing Li, CCochran, SFerro, V Application of the four-component Ugi condensation for the preparation of sulfated glycoconjugate libraries. Bioorg Med Chem Lett 14:2221-6 (2004)  
Target
Name:
Fibroblast growth factor 2
Synonyms:
Basic fibroblast growth factor FGF2 FGFB Fibroblast growth factor receptor 2 (FGF-2) Heparin-binding growth factor 2
Type:
Protein
Mol. Mass.:
30803.89
Organism:
Homo sapiens (Human)
Description:
P09038
Residue:
288
  
Inhibitor
Name:
BDBM50144524
Synonyms:
CHEMBL3215307 | Sodium sulfated glycoconjugate derivative
Type:
Small organic molecule
Emp. Form.:
C39H60N4Na8O40S8
Mol. Mass.:
1665.335
SMILES:
[Na+].[Na+].[Na+].[Na+].[Na+].[Na+].[Na+].[Na+].CC(C)(CC(=O)N(CCO[C@H]1O[C@@H](COS([O-])(=O)=O)[C@@H](OS([O-])(=O)=O)[C@H](OS([O-])(=O)=O)[C@H]1OS([O-])(=O)=O)CC(=O)NC1CCCCC1)CC(=O)N(CCO[C@H]1O[C@@H](COS([O-])(=O)=O)[C@@H](OS([O-])(=O)=O)[C@H](OS([O-])(=O)=O)[C@H]1OS([O-])(=O)=O)CC(=O)NC1CCCCC1
: