Target
Fibroblast growth factor 1
Ligand
BDBM50144527
Substrate
Meas. Tech.
ChEBML_70464
Kd
260000±n/a nM
Citation
 Liu, LPing Li, CCochran, SFerro, V Application of the four-component Ugi condensation for the preparation of sulfated glycoconjugate libraries. Bioorg Med Chem Lett 14:2221-6 (2004)  
Target
Name:
Fibroblast growth factor 1
Synonyms:
Acidic fibroblast growth factor ECGF-beta FGF1_HUMAN Fibroblast growth factor 1 (FGF-1) Heparin-binding growth factor 1 | aFGF
Type:
Protein
Mol. Mass.:
17461.01
Organism:
Homo sapiens (Human)
Description:
P05230
Residue:
155
  
Inhibitor
Name:
BDBM50144527
Synonyms:
CHEMBL3215305 | Sodium sulfated glycoconjugate derivative
Type:
Small organic molecule
Emp. Form.:
C24H33N2Na3O17S3
Mol. Mass.:
786.686
SMILES:
[Na+].[Na+].[Na+].CO[C@H]1O[C@@H](COCC(=O)N(CC(=O)NC2CCCCC2)Cc2ccccc2)[C@@H](OS([O-])(=O)=O)[C@H](OS([O-])(=O)=O)[C@H]1OS([O-])(=O)=O
: