Target
Gonadotropin-releasing hormone receptor
Ligand
BDBM50144640
Substrate
Meas. Tech.
ChEBML_71592
Ki
0.700000±n/a nM
Citation
 Rowbottom, MWTucci, FCZhu, YFGuo, ZGross, TDReinhart, GJXie, QStruthers, RSSaunders, JChen, C Synthesis and structure-activity relationships of (R)-1-alkyl-3-[2-(2-amino)phenethyl]-5-(2-fluorophenyl)-6-methyluracils as human GnRH receptor antagonists. Bioorg Med Chem Lett 14:2269-74 (2004)  
Target
Name:
Gonadotropin-releasing hormone receptor
Synonyms:
GNRHR GRHR GnRH-R Gonadotropin-releasing hormone receptor | Gonadotropin-releasing hormone receptor (GnRH)
Type:
Enzyme
Mol. Mass.:
37749.45
Organism:
Homo sapiens (Human)
Description:
P30968
Residue:
328
  
Inhibitor
Name:
BDBM50144640
Synonyms:
3-((R)-2-Amino-2-phenyl-ethyl)-1-(2-chloro-6-fluoro-benzyl)-5-(2-fluoro-phenyl)-6-methyl-1H-pyrimidine-2,4-dione; TFA | CHEMBL75347
Type:
Small organic molecule
Emp. Form.:
C26H22ClF2N3O2
Mol. Mass.:
481.922
SMILES:
Cc1c(-c2ccccc2F)c(=O)n(C[C@H](N)c2ccccc2)c(=O)n1Cc1c(F)cccc1Cl
: