Target
HPr kinase/phosphorylase
Ligand
BDBM50144925
Substrate
Meas. Tech.
ChEMBL_87254 (CHEMBL699244)
EC50
29000±n/a nM
Citation
 Ramström, HBourotte, MPhilippe, CSchmitt, MHaiech, JBourguignon, JJ Heterocyclic bis-cations as starting hits for design of inhibitors of the bifunctional enzyme histidine-containing protein kinase/phosphatase from Bacillus subtilis. J Med Chem 47:2264-75 (2004)  
Target
Name:
HPr kinase/phosphorylase
Synonyms:
HPRK_BACSU hprK yvoB
Type:
PROTEIN
Mol. Mass.:
34693.07
Organism:
Bacillus subtilis
Description:
ChEMBL_81578
Residue:
310
  
Inhibitor
Name:
BDBM50144925
Synonyms:
2-Amino-3-benzyl-1-dodecyl-3H-benzoimidazol-1-ium | CHEMBL73671
Type:
Small organic molecule
Emp. Form.:
C26H38N3
Mol. Mass.:
392.5995
SMILES:
CCCCCCCCCCCCn1c2ccccc2n(Cc2ccccc2)c1=[NH2+]
: