Target
Potassium voltage-gated channel subfamily A member 3
Ligand
BDBM10458
Substrate
Meas. Tech.
ChEMBL_214956 (CHEMBL821185)
Kd
195000±n/a nM
Citation
 Baell, JBGable, RWHarvey, AJToovey, NHerzog, THänsel, WWulff, H Khellinone derivatives as blockers of the voltage-gated potassium channel Kv1.3: synthesis and immunosuppressive activity. J Med Chem 47:2326-36 (2004)  
Target
Name:
Potassium voltage-gated channel subfamily A member 3
Synonyms:
HGK5 HPCN3 KCNA3 Potassium voltage-gated channel subfamily A member 3 Voltage-gated potassium channel subunit Kv1.3
Type:
PROTEIN
Mol. Mass.:
63835.47
Organism:
Homo sapiens (Human)
Description:
ChEMBL_1513935
Residue:
575
  
Inhibitor
Name:
BDBM10458
Synonyms:
4-AP CHEMBL284348 pyridin-4-amine
Type:
Small organic molecule
Emp. Form.:
C5H6N2
Mol. Mass.:
94.1145
SMILES:
Nc1ccncc1
: