Target
Neuropeptide Y receptor type 4
Ligand
BDBM50578268
Substrate
Meas. Tech.
ChEMBL_2132463 (CHEMBL4841978)
EC50
2.1±n/a nM
Citation
 Konieczny, AConrad, MErtl, FJGleixner, JGattor, AOGrätz, LSchmidt, MFNeu, EHorn, AHCWifling, DGmeiner, PClark, TSticht, HKeller, M N-Terminus to Arginine Side-Chain Cyclization of Linear Peptidic Neuropeptide Y Y J Med Chem 64:16746-16769 (2021)  
Target
Name:
Neuropeptide Y receptor type 4
Synonyms:
NPY-Y4 NPY4R PP1 Pancreatic polypeptide receptor 1
Type:
Enzyme Catalytic Domain
Mol. Mass.:
42207.58
Organism:
Homo sapiens (Human)
Description:
NPY-Y4 PPYR1 HUMAN::P50391
Residue:
375
  
Inhibitor
Name:
BDBM50578268
Synonyms:
CHEMBL4856311
Type:
Small organic molecule
Emp. Form.:
C53H81N19O10
Mol. Mass.:
1144.3315
SMILES:
CC(C)C[C@H](NC(=O)[C@@H]1CCCNC(=N)NC(=O)NCCCCNC(=O)CCC(=O)N[C@@H](CCCNC(N)=N)C(=O)N[C@@H](Cc2c[nH]c3ccccc23)C(=O)N1)C(=O)N[C@@H](CCCNC(N)=N)C(=O)N[C@@H](Cc1ccc(O)cc1)C(N)=O
: