Target
Neuropeptide Y receptor type 4
Ligand
BDBM50578262
Substrate
Meas. Tech.
ChEMBL_2132465 (CHEMBL4841980)
EC50
2.7±n/a nM
Citation
 Konieczny, AConrad, MErtl, FJGleixner, JGattor, AOGrätz, LSchmidt, MFNeu, EHorn, AHCWifling, DGmeiner, PClark, TSticht, HKeller, M N-Terminus to Arginine Side-Chain Cyclization of Linear Peptidic Neuropeptide Y Y J Med Chem 64:16746-16769 (2021)  
Target
Name:
Neuropeptide Y receptor type 4
Synonyms:
NPY-Y4 NPY4R PP1 Pancreatic polypeptide receptor 1
Type:
Enzyme Catalytic Domain
Mol. Mass.:
42207.58
Organism:
Homo sapiens (Human)
Description:
NPY-Y4 PPYR1 HUMAN::P50391
Residue:
375
  
Inhibitor
Name:
BDBM50578262
Synonyms:
CHEMBL4873376
Type:
Small organic molecule
Emp. Form.:
C51H80N18O11
Mol. Mass.:
1121.2949
SMILES:
CC(C)C[C@H](NC(=O)[C@@H]1CCCNC(=N)NC(=O)NCCCCNC(=O)CCC(=O)N[C@@H](CCCNC(N)=N)C(=O)N[C@@H](Cc2ccc(O)cc2)C(=O)N1)C(=O)N[C@@H](CCCNC(N)=N)C(=O)N[C@@H](Cc1ccc(O)cc1)C(N)=O
: