Target
Indoleamine 2,3-dioxygenase 1
Ligand
BDBM50578623
Substrate
Meas. Tech.
ChEMBL_2133627 (CHEMBL4843237)
IC50
0.690000±n/a nM
Citation
 Hamilton, MMMseeh, FMcAfoos, TJLeonard, PGReyna, NJHarris, ALXu, AHan, MSoth, MJCzako, BTheroff, JPMandal, PKBurke, JPVirgin-Downey, BPetrocchi, APfaffinger, DRogers, NEParker, CAYu, SSJiang, YKrapp, SLammens, ATrevitt, GTremblay, MRMikule, KWilcoxen, KCross, JBJones, PMarszalek, JRLewis, RT Discovery of IACS-9779 and IACS-70465 as Potent Inhibitors Targeting Indoleamine 2,3-Dioxygenase 1 (IDO1) Apoenzyme. J Med Chem 64:11302-11329 (2021)  
Target
Name:
Indoleamine 2,3-dioxygenase 1
Synonyms:
I23O1_HUMAN IDO-1 INDO Indoleamine 2,3-dioxygenase | Indoleamine-pyrrole 2,3-dioxygenase
Type:
Enzyme
Mol. Mass.:
45330.80
Organism:
Homo sapiens (Human)
Description:
P14902
Residue:
403
  
Inhibitor
Name:
BDBM50578623
Synonyms:
CHEMBL4858888
Type:
Small organic molecule
Emp. Form.:
C22H20ClF2N3O
Mol. Mass.:
415.864
SMILES:
[H][C@@]12C[C@H](C[C@]1([H])[C@H]2C(C)NC(=O)c1ccc(Cl)cc1)n1cnc2cc(F)c(F)cc12
: