Target
Type-1 angiotensin II receptor B
Ligand
BDBM50145964
Substrate
Meas. Tech.
ChEMBL_34817 (CHEMBL648961)
IC50
13±n/a nM
Citation
 Cappelli, APericot Mohr Gl, GGallelli, ARizzo, MAnzini, MVomero, SMennuni, LFerrari, FMakovec, FMenziani, MCDe Benedetti, PGGiorgi, G Design, synthesis, structural studies, biological evaluation, and computational simulations of novel potent AT(1) angiotensin II receptor antagonists based on the 4-phenylquinoline structure. J Med Chem 47:2574-86 (2004)  
Target
Name:
Type-1 angiotensin II receptor B
Synonyms:
AGTRB_RAT Agtr1 Angiotensin II AT1B Angiotensin II type 1b (AT-1b) receptor Type-1B angiotensin II receptor
Type:
Enzyme Catalytic Domain
Mol. Mass.:
40929.44
Organism:
RAT
Description:
Angiotensin II AT1B 0 RAT::P29089
Residue:
359
  
Inhibitor
Name:
BDBM50145964
Synonyms:
4-[4-(2-Ethyl-5,7-dimethyl-imidazo[4,5-b]pyridin-3-ylmethyl)-phenyl]-2-methylamino-quinoline-3-carboxylic acid | CHEMBL86562
Type:
Small organic molecule
Emp. Form.:
C28H27N5O2
Mol. Mass.:
465.5463
SMILES:
CCc1nc2c(C)cc(C)nc2n1Cc1ccc(cc1)-c1c(C(O)=O)c(NC)nc2ccccc12
: