Target
Endothelin-1 receptor
Ligand
BDBM50146622
Substrate
Meas. Tech.
ChEBML_63215
IC50
0.500000±n/a nM
Citation
 Funk, OFKettmann, VDrimal, JLanger, T Chemical function based pharmacophore generation of endothelin-A selective receptor antagonists. J Med Chem 47:2750-60 (2004)  
Target
Name:
Endothelin-1 receptor
Synonyms:
EDNRA_RAT Ednra Endothelin-1 receptor
Type:
Enzyme Catalytic Domain
Mol. Mass.:
48256.91
Organism:
RAT
Description:
ENDOTHELIN A EDNRA RAT::P26684
Residue:
426
  
Inhibitor
Name:
BDBM50146622
Synonyms:
(Z)-2-(7-Methoxy-benzo[1,3]dioxol-5-yl)-4-(4-methoxy-phenyl)-4-oxo-3-(3,4,5-trimethoxy-benzyl)-but-2-enoic acid | CHEMBL174573
Type:
Small organic molecule
Emp. Form.:
C29H28O10
Mol. Mass.:
536.5266
SMILES:
COc1ccc(cc1)C(=O)C(\Cc1cc(OC)c(OC)c(OC)c1)=C(/C(O)=O)c1cc2OCOc2c(OC)c1
: