Target
Hormone-sensitive lipase
Ligand
BDBM50147299
Substrate
Meas. Tech.
ChEMBL_88045 (CHEMBL695907)
IC50
1±n/a nM
Citation
 Lowe, DBMagnuson, SQi, NCampbell, AMCook, JHong, ZWang, MRodriguez, MAchebe, FKluender, HWong, WCBullock, WHSalhanick, AIWitman-Jones, TBowling, MEKeiper, CClairmont, KB In vitro SAR of (5-(2H)-isoxazolonyl) ureas, potent inhibitors of hormone-sensitive lipase. Bioorg Med Chem Lett 14:3155-9 (2004)  
Target
Name:
Hormone-sensitive lipase
Synonyms:
HSL Hormone-sensitive lipase (HSL) LIPS_HUMAN
Type:
Protein
Mol. Mass.:
116599.07
Organism:
Homo sapiens (Human)
Description:
Q05469
Residue:
1076
  
Inhibitor
Name:
BDBM50147299
Synonyms:
4-Butyl-3-methyl-2-(4-methyl-piperidine-1-carbonyl)-2H-isoxazol-5-one CHEMBL322794
Type:
Small organic molecule
Emp. Form.:
C15H24N2O3
Mol. Mass.:
280.3627
SMILES:
CCCCc1c(C)n(oc1=O)C(=O)N1CCC(C)CC1
: