Target
Serine/threonine-protein kinase B-raf
Ligand
BDBM50580083
Substrate
Meas. Tech.
ChEMBL_2146551 (CHEMBL5030897)
Ki
<0.080000±n/a nM
Citation
 Huestis, MPDela Cruz, DDiPasquale, AGDurk, MREigenbrot, CGibbons, PGobbi, AHunsaker, TLLa, HLeung, DHLiu, WMalek, SMerchant, MMoffat, JGMuli, CSOrr, CJParr, BTShanahan, FSneeringer, CJWang, WYen, IYin, JSiu, MRudolph, J Targeting KRAS Mutant Cancers via Combination Treatment: Discovery of a 5-Fluoro-4-(3 J Med Chem 64:3940-3955 (2021)  
Target
Name:
Serine/threonine-protein kinase B-raf
Synonyms:
B-RAF B-Raf proto-oncogene serine/threonine-protein kinase BRAF1 RAFB1 v-Raf murine sarcoma viral oncogene homolog B1
Type:
Serine/threonine-protein kinase
Mol. Mass.:
84446.00
Organism:
Homo sapiens (Human)
Description:
P15056
Residue:
766
  
Inhibitor
Name:
BDBM50580083
Synonyms:
CHEMBL5094268
Type:
Small organic molecule
Emp. Form.:
C23H27FN6O2
Mol. Mass.:
438.4979
SMILES:
Cc1cc(F)c(NC(=O)NCCC(C)(C)C)cc1NC(=O)c1cccc2c(N)ncnc12
: