Target
Adenosine receptor A1
Ligand
BDBM50090688
Substrate
Meas. Tech.
ChEMBL_29112 (CHEMBL638724)
Ki
9.9±n/a nM
Citation
 Ferrarini, PLBetti, LCavallini, TGiannaccini, GLucacchini, AManera, CMartinelli, AOrtore, GSaccomanni, GTuccinardi, T Study on affinity profile toward native human and bovine adenosine receptors of a series of 1,8-naphthyridine derivatives. J Med Chem 47:3019-31 (2004)  
Target
Name:
Adenosine receptor A1
Synonyms:
AA1R_BOVIN ADENOSINE A1 high ADORA1 | Adenosine A1 receptor
Type:
Enzyme Catalytic Domain
Mol. Mass.:
36602.99
Organism:
BOVINE
Description:
ADENOSINE 0 BOVINE::P28190
Residue:
326
  
Inhibitor
Name:
BDBM50090688
Synonyms:
7-Methyl-2-(4-nitro-phenyl)-[1,8]naphthyridin-4-ol | CHEMBL316630
Type:
Small organic molecule
Emp. Form.:
C15H11N3O3
Mol. Mass.:
281.2661
SMILES:
Cc1ccc2c(O)cc(nc2n1)-c1ccc(cc1)[N+]([O-])=O
: