Target
Adenosine receptor A2a
Ligand
BDBM50090690
Substrate
Meas. Tech.
ChEMBL_27616 (CHEMBL639492)
Ki
470±n/a nM
Citation
 Ferrarini, PLBetti, LCavallini, TGiannaccini, GLucacchini, AManera, CMartinelli, AOrtore, GSaccomanni, GTuccinardi, T Study on affinity profile toward native human and bovine adenosine receptors of a series of 1,8-naphthyridine derivatives. J Med Chem 47:3019-31 (2004)  
Target
Name:
Adenosine receptor A2a
Synonyms:
A2A adenosine receptor (hA2A) ADENOSINE A2 ADORA2 Adenosine A2A receptor (A2AAR)
Type:
G Protein-Coupled Receptor (GPCR)
Mol. Mass.:
44716.46
Organism:
Homo sapiens (Human)
Description:
P29274
Residue:
412
  
Inhibitor
Name:
BDBM50090690
Synonyms:
2-(2-Fluoro-phenyl)-7-methyl-[1,8]naphthyridin-4-ol | CHEMBL95384
Type:
Small organic molecule
Emp. Form.:
C15H11FN2O
Mol. Mass.:
254.259
SMILES:
Cc1ccc2c(O)cc(nc2n1)-c1ccccc1F
: