Target
Fucose-binding lectin PA-IIL
Ligand
BDBM50505617
Substrate
Meas. Tech.
ChEMBL_2147494 (CHEMBL5031840)
Kd
430±n/a nM
Citation
 Mohy El Dine, TJimmidi, RDiaconu, AFransolet, MMichiels, CDe Winter, JGillon, EImberty, ACoenye, TVincent, SP Pillar[5]arene-Based Polycationic Glyco[2]rotaxanes Designed as  J Med Chem 64:14728-14744 (2021)  
Target
Name:
Fucose-binding lectin PA-IIL
Synonyms:
LecB | PA-IIL
Type:
Protein
Mol. Mass.:
11857.84
Organism:
Pseudomonas aeruginosa
Description:
Q9HYN5
Residue:
115
  
Inhibitor
Name:
BDBM50505617
Synonyms:
CHEMBL1234282
Type:
Small organic molecule
Emp. Form.:
C7H14O5
Mol. Mass.:
178.1831
SMILES:
CO[C@@H]1O[C@@H](C)[C@@H](O)[C@@H](O)[C@@H]1O
: