Target
Falcipain 2
Ligand
BDBM50148049
Substrate
Meas. Tech.
ChEMBL_69696 (CHEMBL682031)
IC50
10000±n/a nM
Citation
 Greenbaum, DCMackey, ZHansell, EDoyle, PGut, JCaffrey, CRLehrman, JRosenthal, PJMcKerrow, JHChibale, K Synthesis and structure-activity relationships of parasiticidal thiosemicarbazone cysteine protease inhibitors against Plasmodium falciparum, Trypanosoma brucei, and Trypanosoma cruzi. J Med Chem 47:3212-9 (2004)  
Target
Name:
Falcipain 2
Synonyms:
Cysteine protease falcipain-2 Falcipain-2
Type:
Enzyme
Mol. Mass.:
55912.60
Organism:
Plasmodium falciparum
Description:
Recombinant falcipain-2.
Residue:
484
  
Inhibitor
Name:
BDBM50148049
Synonyms:
(1E)-1-(1,1'-biphenyl-4-yl)ethan-1-one thiosemicarbazone | CHEMBL323975
Type:
Small organic molecule
Emp. Form.:
C15H15N3S
Mol. Mass.:
269.365
SMILES:
CC(=NNC(N)=S)c1ccc(cc1)-c1ccccc1
: