Target
Cruzipain
Ligand
BDBM50148055
Substrate
Meas. Tech.
ChEMBL_51851 (CHEMBL664074)
IC50
10000±n/a nM
Citation
 Greenbaum, DCMackey, ZHansell, EDoyle, PGut, JCaffrey, CRLehrman, JRosenthal, PJMcKerrow, JHChibale, K Synthesis and structure-activity relationships of parasiticidal thiosemicarbazone cysteine protease inhibitors against Plasmodium falciparum, Trypanosoma brucei, and Trypanosoma cruzi. J Med Chem 47:3212-9 (2004)  
Target
Name:
Cruzipain
Synonyms:
CYSP_TRYCR Cruzaine | Major cysteine proteinase
Type:
Protein
Mol. Mass.:
49831.41
Organism:
Trypanosoma cruzi
Description:
P25779
Residue:
467
  
Inhibitor
Name:
BDBM50148055
Synonyms:
(1E)-1-(3-phenoxyphenyl)ethan-1-one thiosemicarbazone | CHEMBL108865
Type:
Small organic molecule
Emp. Form.:
C15H15N3OS
Mol. Mass.:
285.364
SMILES:
CC(=NNC(N)=S)c1cccc(Oc2ccccc2)c1
: