Target
Cysteine protease
Ligand
BDBM50148059
Substrate
Meas. Tech.
ChEMBL_195086 (CHEMBL797540)
IC50
18000±n/a nM
Citation
 Greenbaum, DCMackey, ZHansell, EDoyle, PGut, JCaffrey, CRLehrman, JRosenthal, PJMcKerrow, JHChibale, K Synthesis and structure-activity relationships of parasiticidal thiosemicarbazone cysteine protease inhibitors against Plasmodium falciparum, Trypanosoma brucei, and Trypanosoma cruzi. J Med Chem 47:3212-9 (2004)  
Target
Name:
Cysteine protease
Synonyms:
Rhodesain
Type:
PROTEIN
Mol. Mass.:
48425.78
Organism:
Trypanosoma brucei rhodesiense
Description:
ChEMBL_619861
Residue:
450
  
Inhibitor
Name:
BDBM50148059
Synonyms:
(1E)-1-(4-anilinophenyl)ethan-1-one thiosemicarbazone | CHEMBL107612
Type:
Small organic molecule
Emp. Form.:
C15H16N4S
Mol. Mass.:
284.379
SMILES:
CC(=NNC(N)=S)c1ccc(Nc2ccccc2)cc1
: